La ejecución falló para la tarea ': app: processDebugResources' incluso con las últimas herramientas de compilación

Estoy recibiendo este error cuando intento ejecutar mi proyecto. He instalado las últimas herramientas de la compilación – 23.0.3 pero todavía persiste el error. ¿Cómo puedo solucionar esto?

Executing tasks: [:app:generateDebugSources, :app:generateDebugAndroidTestSources] Configuration on demand is an incubating feature. :app:preBuild UP-TO-DATE :app:preDebugBuild UP-TO-DATE :app:checkDebugManifest :app:preReleaseBuild UP-TO-DATE :app:prepareComAndroidSupportAnimatedVectorDrawable2321Library UP-TO-DATE :app:prepareComAndroidSupportAppcompatV72321Library UP-TO-DATE :app:prepareComAndroidSupportDesign2321Library UP-TO-DATE :app:prepareComAndroidSupportRecyclerviewV72321Library UP-TO-DATE :app:prepareComAndroidSupportSupportV42321Library UP-TO-DATE :app:prepareComAndroidSupportSupportVectorDrawable2321Library UP-TO-DATE :app:prepareComGoogleAndroidGmsPlayServicesAppindexing810Library UP-TO-DATE :app:prepareComGoogleAndroidGmsPlayServicesBasement810Library UP-TO-DATE :app:prepareDebugDependencies :app:compileDebugAidl UP-TO-DATE :app:compileDebugRenderscript UP-TO-DATE :app:generateDebugBuildConfig UP-TO-DATE :app:generateDebugAssets UP-TO-DATE :app:mergeDebugAssets UP-TO-DATE :app:generateDebugResValues UP-TO-DATE :app:generateDebugResources UP-TO-DATE :app:mergeDebugResources UP-TO-DATE :app:processDebugManifest :app:processDebugResources AGPBI: {"kind":"error","text":"Error retrieving parent for item: No resource found that matches the given name \u0027android:TextAppearance.Material.Widget.Button.Inverse\u0027.","sources":[{"file":"C:\\Users\\Ishmita\\Documents\\GitHub\\FurAlert-Native-Build\\app\\build\\intermediates\\res\\merged\\debug\\values-v23\\values-v23.xml","position":{"startLine":3}}],"original":"","tool":"AAPT"} AGPBI: {"kind":"error","text":"Error retrieving parent for item: No resource found that matches the given name \u0027android:Widget.Material.Button.Colored\u0027.","sources":[{"file":"C:\\Users\\Ishmita\\Documents\\GitHub\\FurAlert-Native-Build\\app\\build\\intermediates\\res\\merged\\debug\\values-v23\\values-v23.xml","position":{"startLine":32}}],"original":"","tool":"AAPT"} FAILED FAILURE: Build failed with an exception. 

CONSTRUCCIÓN FALLIDA

Tiempo total: 5.901 seg.

Administrador de SDK

6 Solutions collect form web for “La ejecución falló para la tarea ': app: processDebugResources' incluso con las últimas herramientas de compilación”

Establezca su compileSdkVersion en 23 en el archivo build.gradle su módulo.

En mi caso, problema resuelto haciendo biblioteca y app build.gradle mismo … compileSdkVersion y buildToolsVersion.

Biblioteca build.gradle y

 android { compileSdkVersion 25 buildToolsVersion "25.0.0" ..... ..... } 

App build.gradle

 android { compileSdkVersion 25 buildToolsVersion "25.0.0" ..... ..... } 

Error: Error en la ejecución de la tarea com.android.ide.common.process.ProcessException: org.gradle.process.internal.ExecException:

Terminado con un valor de salida distinto de cero 1

Una razón para este error occure es que la ruta de acceso de archivo a un archivo de recurso es larga:

 Error: File path too long on Windows, keep below 240 characters 

Solución: mueva la carpeta del proyecto más cerca de la raíz de su disco

No : // carpeta / carpeta / carpeta / carpeta / nombre_de_pastilla_muy_ / miProyecto …

Do : // carpeta / short_name / MyProject


Otra razón podría ser recursos duplicados o espacios de nombres

Ejemplo:

  <style name="MyButton" parent="android:Widget.Button"> <item name="android:textColor">@color/accent_color</item> <item name="android:textColor">#000000</item> </style> 

Asegúrese de que todos los nombres de archivo y extensiones estén en minúsculas

Incorrecto

 myimage.PNG myImage.png 

Correcto

 my_image.png 

Asegúrese de limpiar / reconstruir el proyecto

(Eliminar la carpeta 'build')

Otra posible razón

 resConfigs "hdpi", "xhdpi", "xxhdpi", "xxxhdpi" 

Puede ser la fuente de este problema

Como una solución rápida a esta pregunta, asegúrese de que su compilación Sdk verion, su buildtoolsversion, su appcompat y, finalmente, su biblioteca de soporte están todos ejecutándose en la misma versión sdk, para mayor claridad echar un vistazo a la imagen que acaba de subir. Aclamaciones. Siga las anotaciones rojas y deshágase de ese problema.

Introduzca aquí la descripción de la imagen

Quiero añadir que a veces el estudio de android pierde la pista del archivo de recursos y no puede construir en el lanzamiento. Si las respuestas anteriores no sirven, pruebe

 Build => Rebuild Project 

He perdido muchas horas de esto cuando era un principiante en Android Studio.

  • Problemas incluyendo Apache HttpComponents en el proyecto de Android Gradle
  • Gradle versión 1.10 es necesario. La versión actual es 2.0
  • Android Studio: Fallo
  • ¿Cómo forzar a Android Studio a construir con la biblioteca actualizada NDK, sin tener que limpiar y construir todo el proyecto?
  • Agregue el producto a la experimental Android gradle plugin library
  • Gradle no pudo resolver
  • Autoincremento de Gradle y Renombrar APK I / O Error
  • Conflicto con dependencia 'com.android.support:support-annotations'. Las versiones resueltas para la aplicación (23.1.0) y la aplicación de prueba (23.0.1) difieren
  • Android: Error al convertir byte a dex
  • No se puede resolver el símbolo 'AndroidJUnit4'
  • No se puede normalizar la ruta en bintrayUpload
  • FlipAndroid es un fan de Google para Android, Todo sobre Android Phones, Android Wear, Android Dev y Aplicaciones para Android Aplicaciones.