Tag: androide gradle

La generación de Gradle falla con "No se puede leer la ruta" cuando se ejecuta instantánea está deshabilitada

Mi Ambiente: Android Studio 2.1.2 Android Gradle Plugin v2.1.2 Mac OSX v10.11.5 Hasta ahora, he desactivado Instant Run cuando llamo a "Build => clean Project" y ejecuto mi proyecto. La razón por la que he desactivado Instant Run es debido a esto y este problema. Sin embargo, recientemente, empecé a correr con este problema cada […]

Android Studio versión instantánea construcción completa lenta

Cuando se activa la Instant Run , la compilación completa ocupará mi 100% de mi CPU. El macbook es rezagado y casi inutilizable. Tiempo de construcción: Command line: Total time: 1 mins 35.025 secs Android Studio: Total time: 4 mins 23.928 secs Si la ejecución instantánea está deshabilitada, obtengo las mismas veces que en la […]

¿Cómo puedo crear una aplicación NDK con Android Studio 2.1 y com.android.tools.build:gradle:2.1.0?

He buscado en Google un poco, pero todos los ejemplos de NDK parecen usar com.android.tools.build:gradle-experimental:0.7.0. Los ejemplos de https://github.com/googlesamples/android-ndk también usan com.android.tools.build:gradle-experimental:0.7.0. Si cambio a com.android.tools.build:gradle:2.1.0, estos proyectos simplemente no construyen. En primer lugar está el error en el que no puede encontrar plug-in para apply plugin: 'com.android.model.application' (tuvo que cambiar a 'com.android.application' ) y […]

Java.lang.NoClassDefFoundError: Resolución fallida de: Landroid / support / v4 / util / ArrayMap;

Hoy he encontrado este error al intentar ejecutar mi aplicación. Hice los siguientes intentos de resolverlo. – Primero he eliminado soporte multidex, pero todavía puedo ver las rodajas de apk allí. -i también intentó reconstruir el proyecto entero, y actualizado el androide de soporte y reproducir las bibliotecas de servicios a la última como recomendado […]

La tarea gradle 'installDebug' de Android dejó de funcionar después de la actualización

Tarea installDevDebug dejó de funcionar después de actualizar gradle plugin de 2.1.3 a 2.3.3 ./gradlew installDevDebug … Unable to install /Users/user/Android/MyApp/app/build/outputs/apk/App-1.34.0-dev- debug-unaligned.apk com.android.ddmlib.InstallException: Failed to install all at com.android.ddmlib.SplitApkInstaller.install(SplitApkInstaller.java:96) at com.android.ddmlib.Device.installPackages(Device.java:904) at com.android.builder.testing.ConnectedDevice.installPackages(ConnectedDevice.java:136) at com.android.build.gradle.internal.tasks.InstallVariantTask.install(InstallVariantTask.java:134) at org.gradle.internal.reflect.JavaMethod.invoke(JavaMethod.java:73) Construir un gradiente … buildscript { ext.gradle_plugin_version = '2.3.3' } android { compileSdkVersion 25 buildToolsVersion "25.0.3" … productFlavors […]

Cambiar nombre de archivo apk en gradle

Estoy tratando de usar las herramientas de compilación android "com.android.tools.build:gradle:3.0.0-alpha4" en mi proyecto. En mi script de construcción renombro el apk de salida que funcionó bien en el pasado, pero no parece ser soportado más. applicationVariants.all { variant -> def filename = "foo-${variant.baseName}-${variant.versionName}-(${android.defaultConfig.versionCode}).apk" variant.outputs.all { output -> output.outputFile = new File( output.outputFile.parent, filename ) } […]

Apache POI Libraries error en Android Studio ..?

He añadido 5 archivos jar Apache POI para que pueda guardar un texto como documento. Docx pero no puedo ejecutar la primera aplicación Tenía 210 error en el grado ahora tengo este error alguien puede ayudarme ..!? He seguido este ejemplo https://www.tutorialspoint.com/apache_poi_word/apache_poi_word_quick_guide.htm apply plugin: 'com.android.application' android { compileSdkVersion 25 buildToolsVersion "25.0.0" defaultConfig { applicationId "com.example.mike.textword" […]

Android Studio, Fire TV – Problemas de compilación con Amazon SDK

Todavía soy excepcionalmente nuevo en Android Development, alrededor de 2 semanas en mi primer proyecto. Por lo tanto, una resolución puede ser obvia, y sólo puedo esperar que esto finalmente ayuda a otro en mis zapatos. El objetivo era crear una aplicación para FireTV que transmitiera los medios de comunicación (stream on-demand o video en […]

App: processDebugResources – IllegalArgumentException (sin mensaje de error)

Cuando construyo Gradle obtengo este mensaje de error: Error:00:29:02.408 [ERROR] [org.gradle.internal.buildevents.BuildExceptionReporter] 00:29:02.408 [ERROR] [org.gradle.internal.buildevents.BuildExceptionReporter] FAILURE: Build failed with an exception. 00:29:02.408 [ERROR] [org.gradle.internal.buildevents.BuildExceptionReporter] 00:29:02.408 [ERROR] [org.gradle.internal.buildevents.BuildExceptionReporter] * What went wrong: 00:29:02.408 [ERROR] [org.gradle.internal.buildevents.BuildExceptionReporter] Execution failed for task ':app:processDebugResources'. 00:29:02.408 [ERROR] [org.gradle.internal.buildevents.BuildExceptionReporter] > java.lang.IllegalArgumentException (no error message) 00:29:02.408 [ERROR] [org.gradle.internal.buildevents.BuildExceptionReporter] 00:29:02.408 [ERROR] [org.gradle.internal.buildevents.BuildExceptionReporter] * Exception is: […]

Error: (26, 13) Error al resolver: com.android.support:appcompat-v7:25.0.1

Error: (26, 13) Error al resolver: com.android.support:appcompat-v7:25.0.1 & Error: (23, 24) Error al resolver: com.android.support.test.espresso: espresso-core: 2,0 Aquí está mi archivo gradle apply plugin: 'com.android.application' android { compileSdkVersion 25 buildToolsVersion "25.0.1" defaultConfig { applicationId "com.example.jignesh.myapplication" minSdkVersion 25 targetSdkVersion 25 versionCode 1 versionName "1.0" testInstrumentationRunner "android.support.test.runner.AndroidJUnitRunner" } buildTypes { release { minifyEnabled false proguardFiles getDefaultProguardFile('proguard-android.txt'), 'proguard-rules.pro' […]

FlipAndroid es un fan de Google para Android, Todo sobre Android Phones, Android Wear, Android Dev y Aplicaciones para Android Aplicaciones.