Android Studio no funciona mientras crea una aplicación mediante AppCompat v23 y API21

Estoy utilizando la versión Android 1.3 y SDK para 5.0.1 Decapitado porque cada vez que construyo el proyecto lanza error.

¿Puede alguien por favor decir en detalles cómo hacerlo ..

Error:

Information:Gradle tasks [:app:assembleDebug] :app:preBuild UP-TO-DATE :app:preDebugBuild UP-TO-DATE :app:checkDebugManifest :app:preReleaseBuild UP-TO-DATE :app:prepareComAndroidSupportAppcompatV72300Library UP-TO-DATE :app:prepareComAndroidSupportSupportV42300Library UP-TO-DATE :app:prepareDebugDependencies :app:compileDebugAidl UP-TO-DATE :app:compileDebugRenderscript UP-TO-DATE :app:generateDebugBuildConfig UP-TO-DATE :app:generateDebugAssets UP-TO-DATE :app:mergeDebugAssets UP-TO-DATE :app:generateDebugResValues UP-TO-DATE :app:generateDebugResources UP-TO-DATE :app:mergeDebugResources UP-TO-DATE :app:processDebugManifest UP-TO-DATE :app:processDebugResources C:\Users\This-PC\AndroidStudioProjects\MyApplication\app\build\intermediates\exploded-aar\com.android.support\appcompat-v7\23.0.0\res\values-v23\values-v23.xml Error:(2) Error retrieving parent for item: No resource found that matches the given name 'android:TextAppearance.Material.Widget.Button.Inverse'. Error:(2) Error retrieving parent for item: No resource found that matches the given name 'android:Widget.Material.Button.Colored'. Error:Execution failed for task ':app:processDebugResources'. > com.android.ide.common.process.ProcessException: org.gradle.process.internal.ExecException: Process 'command 'C:\Users\This-PC\AppData\Local\Android\Sdk\build-tools\22.0.1\aapt.exe'' finished with non-zero exit value 1 Information:BUILD FAILED Information:Total time: 1.701 secs Information:3 errors Information:0 warnings Information:See complete output in console 

y

El registro de sucesos muestra:

 10:52:47 PM Platform and Plugin Updates: A new version of Android Studio is available! (show balloon) 10:52:48 PM Gradle sync started 10:53:22 PM Gradle sync failed: failed to find target android-22 : C:\Users\This-PC\AppData\Local\Android\Sdk Consult IDE log for more details (Help | Show Log) 11:06:43 PM Gradle sync started 11:06:49 PM Gradle sync completed 11:06:50 PM Executing tasks: [:app:generateDebugSources, :app:generateDebugAndroidTestSources] 11:07:03 PM Gradle build finished with 3 error(s) in 13s 912ms 11:09:47 PM Executing tasks: [:app:assembleDebug] 11:09:50 PM Gradle build finished with 3 error(s) in 2s 345ms 11:10:44 PM Throwable: Failed to fetch URL https://dl.google.com/android/repository/addons_list-2.xml, reason: Unknown Host dl.google.com 11:15:08 PM Error Report: Submitted 11:15:55 PM Executing tasks: [:app:assembleDebug] 11:15:57 PM Gradle build finished with 3 error(s) in 1s 992ms 

2 Solutions collect form web for “Android Studio no funciona mientras crea una aplicación mediante AppCompat v23 y API21”

Está utilizando la appcompat (y otras bibliotecas de soporte) v23 .
Tienes que compilar tu proyecto con API 23 .

Cambie en su build.gradle la compileSdkVersion a 23

Debe actualizar su SDK a la API 23 (en caso de que compile con 23).
compileSdkVersion y la versión de las bibliotecas de soporte deben ser los mismos. El siguiente código indica que estos son los mismos que en la línea 3 y la segunda línea en las dependencies .

 apply plugin: 'com.android.application' android { compileSdkVersion 23 buildToolsVersion "23.0.0" defaultConfig { applicationId "com.example.inzi.app" minSdkVersion 9 targetSdkVersion 23 versionCode 1 versionName "1.0" } buildTypes { release { minifyEnabled false proguardFiles getDefaultProguardFile('proguard-android.txt'), 'proguard-rules.pro' } } } dependencies { compile fileTree(dir: 'libs', include: ['*.jar']) compile 'com.android.support:appcompat-v7:23.0.0' } 
  • ¿Es posible probar contra la versión de lanzamiento de tu aplicación con el complemento Android Gradle?
  • Fallo de construcción Gradle
  • Cómo agregar .aar dependencia en el módulo de la biblioteca?
  • Ejecución de gradle's connectedAndroidTest en un dispositivo específico
  • Problema con la dimensión de sabor de Android Studio 3.0
  • Cómo inyectar la configuración de Android a cada subproyecto con Gradle?
  • Especificar firma de configuración para Gradle y Cordova 5
  • ¿Cómo puedo especificar por sabor buildType sourceSets?
  • No se pudo encontrar com.google.android.gms: play-services: 5.0.77
  • ¿Es gradlew obligatorio para que travis CI funcione?
  • gcm_defaultSenderId no se puede resolver
  • FlipAndroid es un fan de Google para Android, Todo sobre Android Phones, Android Wear, Android Dev y Aplicaciones para Android Aplicaciones.